{"text_format":"1","workbook":"xlsx","n_sheets":5,"sheets":["Lists","Instructions","Results","Report","508 Impact Guide & Score Sheet"],"not_rendered":{"charts":0,"images":0,"macros":1,"external_links":1,"defined_names":29,"comments":2,"pivot_tables":0},"unopened":[],"bounds":{"document_bytes":16777216,"sheet_cells":100000,"rows_first":2000,"rows_last":500,"rows_between":2000,"halvings":0,"cell_chars":16384,"cell_head_chars":4096},"cells_cut":0,"cells_raw":0,"read":"whole","date_system":"1900"}

{"sheet":"Lists","index":0,"n_rows":24,"n_cols":11,"rows_kept":24,"cut":false,"hidden":true,"merged":[]}
["Standards Options"]
["--"]
["Not Compliant"]
["Compliant"]
["NA"]
["Baseline Options"]
["--","--"]
["Fail","Fail"]
["Pass","DNA"]
["DNA"]
["Not Tested"]
["TT4 lists"]
["--",null,"--",null,"--",null,"--",null,"--",null,"--"]
["Windows 10",null,"N/A",null,"Compliant",null,"N/A",null,"TT3",null,"N/A (SW)"]
["OSX",null,"Internet Explorer 11",null,"Not Compliant",null,"Disabled",null,"TT4",null,"Yes"]
[null,null,"Chrome",null,null,null,"Enabled",null,null,null,"No"]
[null,null,"Firefox",null,null,null,null,null,null,null,"Unknown"]
[]
["TT3 lists"]
["--",null,"--",null,"--",null,"--",null,"--",null,"--"]
["Windows 10",null,"N/A",null,"Compliant",null,"N/A",null,"TT3"]
["OSX",null,"IE11",null,"Not Compliant",null,"Disabled",null,"TT4"]
[null,null,"Chrome",null,null,null,"Enabled"]
[null,null,"Firefox"]

{"sheet":"Instructions","index":1,"n_rows":43,"n_cols":5,"rows_kept":43,"cut":false,"hidden":false,"merged":[[21,4,21,13],[16,3,16,13],[26,2,26,13],[27,3,27,13],[50,2,50,13],[35,2,35,13],[39,2,39,13],[40,2,40,13],[41,4,41,13],[47,4,47,13],[36,2,36,13],[42,4,42,13],[43,4,43,13],[44,4,44,13],[45,4,45,13],[46,4,46,13],[0,2,0,13],[31,3,31,13],[7,2,7,13],[5,2,5,13],[6,2,6,13],[25,2,25,13],[19,2,19,13],[24,3,24,13],[4,2,4,13],[3,2,3,13],[2,2,2,13],[1,2,1,13],[11,3,11,13],[28,3,28,13],[29,3,29,13],[30,3,30,13],[8,2,8,13],[9,2,9,13],[20,4,20,13],[17,2,17,13],[10,3,10,13],[12,3,12,13],[13,3,13,13],[14,3,14,13],[15,3,15,13],[18,3,18,13]]}
[null,null,"Instructions"]
[]
[]
[null,null,"This workbook is protected so that only certain cells are editable and certain operations are allowed. Unprotecting it may allow you to edit it in a way that produces invalid results."]
[null,null,"Some worksheets, such as this one, have Grouping controls in the left margin. These allow you to expand or collapse certain sections for easier viewing, by clicking on the + or - icons or outlines."]
[]
[]
[]
[null,null,"Results Worksheet"]
[null,null,"This is where you enter testing results, which are later compiled into the Report worksheet. You should not add or delete rows manually; use the provided macros instead."]
[null,null,"1.","For each test, enter the test results in the Test Results column. Typing P, F, or D, should autofill with P (Pass), F (Fail) or DNA (Does Not Apply)."]
[null,null,"2.","Enter the failure details in the Failure Details column. All tests marked NC must have failure details."]
[null,null,"3.","To include a screenshot, select the associated cell in the Screenshots column and click Insert Image (or Ctrl-i). Remember to crop screenshots judiciously, as they will be embedded in this workbook and add to its size."]
[null,null,"4.","You should insert only one screenshot per row. To include more than one screenshot for the same failure condition, click Add Row (or Ctrl-d) and insert a new screenshot in the new row."]
[null,null,"5.","To delete a screenshot, select the cell that contains the screenshot and click Delete Image (or Ctrl-j). (If you select the image object instead of the containing cell, you will get an error message.)"]
[null,null,"6.","To view an embedded screenshot (by double-clicking), unprotect the worksheet (Review > Unprotect Sheet). This is also needed if you need to perform formatting operations (e.g. resizing rows, etc.)."]
[null,null,"6.","To delete an added row, click Delete Row (or Ctrl-e). This deletes the screenshot on that row as well."]
[]
[null,null,null,"Most of the following shortcuts should normally be used at the start of testing, as their effects are NOT undoable:"]
[]
[null,null,null,"Toggle DNA","Some sections have \"Toggle DNA\" buttons in the first column. These buttons switch between \"DNA\" and \"--\" for all rows in that section."]
[null,null,null,"Clear All","Clears all Test Results, Failure Details, and screenshots, and deletes added rows."]
[]
[]
[]
[null,null,"Report Worksheet"]
[null,null,"This worksheet provides fields to enter information about the report (e.g. tester name, application name, etc.), and also compiles results from the Results worksheet."]
[null,null,"1.","Enter the header information. (Disabilities Impacted is automatically calculated from the Impact Guide worksheet.)"]
[null,null,"2.","Click Generate Report. This compiles information from the Results worksheet."]
[null,null,"3.","Screenshots from the Results worksheet will not be duplicated here but will be referenced in the Screenshot column of this worksheet. To view a screenshot, select the desired cell in this column and press Ctrl-w."]
[null,null,"4.","The Section 508 Baseline Test Report Checklist section is automatically calculated from the Results worksheet."]
[null,null,"5.","The header section may be collapsed using the Grouping controls in the left margin for easier viewing of the report section below."]
[]
[]
[]
[null,null,"508 Impact Guide Worksheet (if available)"]
[null,null,"This worksheet calculates the impact of the observed failures. No user input is needed."]
[]
[]
[]
[null,null,"Version History"]
[null,null,"5.0","2018-08-16","First draft"]
[null,null,"5.1.3","2024-05-08","5.1.3 update"]

{"sheet":"Results","index":2,"n_rows":70,"n_cols":119,"rows_kept":70,"cut":false,"hidden":false,"merged":[]}
[]
[null,null,"Version 5.1.3"]
[null,null,null,null,null,null,null,null,null,null,null,null,null,null,null,null,null,null,null,null,null,null,null,{"$f":"IF(OR(X4=\"NC\",Y4=\"NC\"),\"NC\",IF(OR(X4=\"C\",Y4=\"C\"),\"C\",IF(OR(X4=\"DNA\",Y4=\"DNA\"),\"DNA\",\"--\")))","v":"--"}]
[null,null,null,null,null,null,null,null,null,"Results:",{"$f":"IF(COUNTIF(K6:K65,\"Fail\"),\"Fail\",IF(COUNTIF(K6:K65,\"Pass\"),\"Pass\",IF(COUNTIF(K6:K65,\"Not Tested\"),\"NT\",IF(COUNTIF(K6:K65,\"DNA\"),\"DNA\",\"--\"))))","v":"--"},"--","--","--","--","--","--","--","--","--","--","--","--","--","--","--","--","--","--","--","--","--","--","--","--","--","--","--","--","--","--","--",{"$f":"IF(COUNTIF(AQ6:AQ65,\"Fail\"),\"Fail\",IF(COUNTIF(AQ6:AQ65,\"Pass\"),\"Pass\",IF(COUNTIF(AQ6:AQ65,\"Not Tested\"),\"NT\",IF(COUNTIF(AQ6:AQ65,\"DNA\"),\"DNA\",\"--\"))))","v":"--"},"--","--","--","--","--","--","--","--","--","--","--","--","--","--","--","--","--","--","--","--","--","--","--","--","--","--","--","--","--","--","--",{"$f":"IF(COUNTIF(BW6:BW65,\"Fail\"),\"Fail\",IF(COUNTIF(BW6:BW65,\"Pass\"),\"Pass\",IF(COUNTIF(BW6:BW65,\"Not Tested\"),\"NT\",IF(COUNTIF(BW6:BW65,\"DNA\"),\"DNA\",\"--\"))))","v":"--"},"--","--","--","--","--","--","--","--","--","--","--","--","--","--","--","--","--","--","--","--","--","--","--","--","--","--","--","--","--","--","--",{"$f":"IF(COUNTIF(DC6:DC65,\"Fail\"),\"Fail\",IF(COUNTIF(DC6:DC65,\"Pass\"),\"Pass\",IF(COUNTIF(DC6:DC65,\"Not Tested\"),\"NT\",IF(COUNTIF(DC6:DC65,\"DNA\"),\"DNA\",\"--\"))))","v":"--"},"--","--","--","--","--","--","--","--","--","--","--","--"]
["Test","Test IDs","Test Condition","Test name","SC","Test Results","Web-only or SW only?","Section ID (for setting NA)","Failure Details (Provide Screen/Location)","Screenshots","Alt-version-conformant","Alt-version-equivalent","Alt-version-access","Alt-version-nc-access","2.2.2-blinking-moving-scrolling","2.2.2-auto-updating","4.1.2-change-notify-auto","1.4.2-audio-control","2.3.1-flash-rate-Web","2.1.1-keyboard-access","2.1.1-no-keystroke-timing","2.1.2-no-keyboard-trap","2.4.7-focus-visible","3.2.1-on-focus","2.4.3-focus-order-meaning","2.4.3-focus-order-reveal","2.4.3-focus-order-return","3.3.2-input-instructions","1.3.1-form-labels-cues","3.2.2-on-input","4.1.2-change-notify-form","3.3.1-error-identification","3.3.3-error-suggestion","3.3.4-error-prevention","2.4.4-link-purpose","4.1.2-change-notify-links","1.1.1-meaningful-image-name","1.1.1-decorative-image","1.1.1- decorative-background-image","1.1.1- font-icon","1.1.1-captcha-alternative","1.4.5-image-of-text","2.2.1-timing-adjustable","2.4.1-bypass-function","3.2.3-consistent- navigation","3.2.4-consistent-identification","2.4.6-heading-purpose","1.3.1-heading-determinable","1.3.1-heading-technique","1.3.1-heading-level","1.3.1-list-type","3.1.1-page-language-defined","3.1.2-part-language-defined","2.4.2-one-page-title-defined","2.4.2-page-title-purpose","4.1.2-frame-title","4.1.2-iframe-name","1.4.1-color-meaning","1.3.3-sensory-info","1.4.3-contrast","1.3.1-table-identification","1.3.1-cell-header-association ","1.3.1-layout-table-structure","1.3.1-meaningful-content-css-before-after","1.3.2-content-order-CSS-position","1.3.2-content-meaning-CSS-position","1.2.1-audio-transcript-text","1.2.1-audio-transcript-text-equivalent","1.2.1-video- alternative-equivalent","1.2.2-captions-equivalent","1.2.5-audio-description-equivalent","1.2.4-captions-live-equivalent","503.4-caption-description-controls","503.4.1-caption-control","503.4.2-description-control","1.4.4-resize-text","2.4.5-multiple-ways","CR1","1.1.1","1.2.1","1.2.2","1.2.3","1.2.4","1.2.5","1.3.1","1.3.2","1.3.3","1.4.1","1.4.2","1.4.3","1.4.4","1.4.5","2.1.1","2.1.2","2.2.1","2.2.2","2.3.1","2.4.1","2.4.2","2.4.3","2.4.4","2.4.5","2.4.6","2.4.7","3.1.1","3.1.2","3.2.1","3.2.2","3.2.3","3.2.4","3.3.1","3.3.2","3.3.3","3.3.4","4.1.1","4.1.2","503.4-","503.4.1","503.4.2"]
["1 Alternate version","A","The identified version passes all applicable Test Conditions in this test process.","Alt-version-conformant","CR1","--",null,1,null,null,{"$f":"IFERROR(IF(SEARCH(K$5,$D6),$F6,\"-\"),\"x\")","v":"--"},"x","x","x","x","x","x","x","x","x","x","x","x","x","x","x","x","x","x","x","x","x","x","x","x","x","x","x","x","x","x","x","x","x","x","x","x","x","x","x","x","x","x","x","x","x","x","x","x","x","x","x","x","x","x","x","x","x","x","x","x","x","x","x",{"$f":"IFERROR(IF(SEARCH(BW$5,$D6),$F6,\"-\"),\"x\")","v":"x"},"x","x",{"$f":"IFERROR(IF(SEARCH(BZ$5,$E6),$F6,\"-\"),\"x\")","v":"--"},{"$f":"IFERROR(IF(SEARCH(CA$5,$E6),$F6,\"-\"),\"x\")","v":"x"},"x","x","x","x","x","x","x","x","x","x","x","x","x","x","x","x","x","x","x","x","x","x","x","x","x","x","x","x","x","x","x","x","x","x","x","x","x","x",{"$f":"IFERROR(IF(SEARCH(DN$5,$E6),$F6,\"-\"),\"x\")","v":"x"},"x"]
[null,"B","The accessible version is up to date with the same information and functionality.","Alt-version-equivalent","CR1","--",null,1,null,null,{"$f":"IFERROR(IF(SEARCH(K$5,$D7),$F7,\"-\"),\"x\")","v":"x"},"--","x","x","x","x","x","x","x","x",{"$f":"IFERROR(IF(SEARCH(U$5,$D7),$F7,\"-\"),\"x\")","v":"x"},"x","x","x","x","x","x","x","x","x",{"$f":"IFERROR(IF(SEARCH(AE$5,$D7),$F7,\"-\"),\"x\")","v":"x"},"x","x","x","x","x","x","x","x","x","x","x","x","x","x","x","x","x","x","x","x","x","x","x","x","x","x","x","x","x","x","x","x","x","x","x","x","x","x","x","x","x","x","x","x","x","x",{"$f":"IFERROR(IF(SEARCH(BZ$5,$E7),$F7,\"-\"),\"x\")","v":"--"},"x","x","x","x","x","x","x","x","x","x","x","x","x","x","x","x","x","x","x","x","x","x","x","x","x","x","x","x","x","x","x","x","x","x","x","x","x","x","x","x","x"]
[null,"C","The mechanism to reach the identified version is accessible.","Alt-version-access","CR1","--",null,1,null,null,"x","x","--","x","x","x","x","x","x","x","x","x","x","x","x","x","x","x","x","x","x","x","x","x","x","x","x","x","x","x","x","x","x","x","x",{"$f":"IFERROR(IF(SEARCH(AT$5,$D8),$F8,\"-\"),\"x\")","v":"x"},"x","x","x","x","x","x","x","x","x","x","x","x","x","x","x","x","x","x","x","x","x","x","x","x","x","x","x","x","x","x","x","--",{"$f":"IFERROR(IF(SEARCH(CA$5,$E8),$F8,\"-\"),\"x\")","v":"x"},"x","x","x","x","x","x","x","x","x","x","x","x","x","x","x","x","x","x","x","x","x","x","x","x","x","x","x","x","x","x","x","x","x","x","x","x","x","x","x","x"]
[null,"D","Content in the non-conforming version(s) meets Conformance Requirement 5.","Non-interference","CR1","--",null,1,null,null,"x","x","x","x","x","x","x","x","x","x","x","x","x","x","x","x","x","x","x","x","x","x","x","x","x","x","x","x","x","x","x","x","x","x","x","x",{"$f":"IFERROR(IF(SEARCH(AU$5,$D9),$F9,\"-\"),\"x\")","v":"x"},"x","x","x","x","x","x","x","x","x","x","x","x","x","x","x",{"$f":"IFERROR(IF(SEARCH(BK$5,$D9),$F9,\"-\"),\"x\")","v":"x"},"x","x","x","x","x","x","x","x","x","x","x","x","x","x","--","x","x","x","x","x","x","x","x","x","x","x","x","x","x","x","x","x","x","x","x","x","x","x","x","x","x","x","x","x","x","x","x","x","x","x","x","x","x","x","x","x"]
["2 Autoplay/update","A","The user can pause, stop, or control the volume of audio content that plays automatically. ","1.4.2-audio-control","1.4.2","--",null,2,null,null,"x","x","x","x","x","x","x","--","x","x","x","x","x","x","x","x","x","x","x","x","x","x","x","x","x","x","x","x","x","x","x","x","x","x","x","x","x","x","x","x","x","x","x","x","x","x","x","x","x","x","x","x","x","x","x","x","x","x","x","x","x","x","x","x","x","x","x","x","x","x","x","x","x","x","x","x","x","x","--","x","x","x","x","x","x","x","x","x","x","x","x","x","x","x","x","x","x","x","x","x","x","x","x","x","x","x","x","x","x"]
[null,"B","The user can pause, stop, or hide moving, blinking, or scrolling content.","2.2.2-blinking-moving-scrolling","2.2.2","--",null,2,null,null,"x","x","x","x","--","x","x","x","x","x","x","x","x","x","x","x","x","x","x","x","x","x","x","x","x","x","x","x","x","x","x","x","x","x","x","x","x","x","x","x","x","x","x","x","x","x","x","x","x","x","x","x","x","x","x","x","x","x","x","x","x","x","x","x","x","x","x","x","x","x","x","x","x","x","x","x","x","x","x","x","x","x","x","x","x","--","x","x","x","x","x","x","x","x","x",{"$f":"IFERROR(IF(SEARCH(DB$5,$E11),$F11,\"-\"),\"x\")","v":"x"},"x","x","x","x","x","x","x","x","x","x","x","x","x"]
[null,"C","The user can pause, stop, hide, or control the frequency of automatically updating content.","2.2.2-auto-updating","2.2.2","--",null,2,null,null,"x","x","x","x","x","--","x","x","x","x","x","x","x","x","x","x","x","x","x","x","x","x","x","x","x","x","x","x","x","x","x","x","x","x","x","x","x","x","x","x","x","x","x","x","x","x","x","x","x","x","x","x","x","x","x","x","x","x","x","x","x","x","x","x","x","x","x","x","x","x","x","x","x","x","x","x","x","x","x","x","x","x","x",{"$f":"IFERROR(IF(SEARCH(CP$5,$E12),$F12,\"-\"),\"x\")","v":"x"},"x","--","x","x","x","x","x","x","x","x","x","x","x","x","x","x","x","x","x","x","x","x","x","x","x"]
[null,"D","The page provides notification of each automatic change in content. ","4.1.2-change-notify-auto","4.1.2","--",null,2,null,null,"x","x","x","x","x","x","--","x","x","x","x","x","x","x","x","x","x","x","x","x","x","x","x","x","x","x","x","x","x","x","x","x","x","x","x","x","x","x","x","x","x","x","x","x","x","x","x","x","x","x","x","x","x","x","x","x","x","x","x","x","x","x","x","x","x","x","x","x","x","x","x","x","x","x","x","x","x","x","x","x","x","x","x","x","x","x","x","x","x","x","x","x","x","x","x","x","x","x","x","x","x","x","x","x","x","--","x","x","x"]
["3 Flashing","A","If NO flashing content is found, then this Test Condition DOES NOT APPLY (DNA). If flashing content IS found, then this test should be recorded as NOT TESTED.","2.3.1-flashing","2.3.1","--",null,3,null,null,"x","x","x","x","x","x","x","x","x","x","x","x","x","x","x","x","x","x","x","x","x","x","x","x","x","x","x","x","x","x","x","x","x","x","x","x","x","x","x","x","x","x","x","x","x","x","x","x","x","x","x","x","x","x","x","x","x","x","x","x","x","x","x","x","x","x","x","x","x","x","x","x","x","x","x","x","x","x","x","x","x","x","x","x","x","x","--","x","x","x","x","x","x","x","x","x","x","x","x","x","x","x","x","x","x","x","x","x","x"]
["4 Keyboard/focus","A","All functionality can be accessed and executed using only the keyboard.","2.1.1-keyboard-access","2.1.1","--",null,4,null,null,"x","x","x","x","x","x","x","x","x","--","x","x","x","x","x","x","x","x","x","x","x","x","x","x","x","x","x","x",{"$f":"IFERROR(IF(SEARCH(AM$5,$D15),$F15,\"-\"),\"x\")","v":"x"},"x","x","x","x","x","x","x","x","x","x","x","x","x","x","x","x","x","x","x","x","x","x","x","x","x","x","x","x","x","x","x","x","x","x","x","x","x","x","x","x","x","x","x","x","x","x","x","x","x","x","x","x","x","--","x","x","x","x","x","x","x","x","x","x","x","x","x","x","x","x","x","x","x","x","x","x","x","x","x","x"]
[null,"B","Individual keystrokes do not require specific timings for activation of functionality.","2.1.1-no-keystroke-timing","2.1.1","--",null,null,null,null,"x","x","x","x","x","x","x","x","x","x","--","x","x","x","x","x","x","x","x","x","x","x","x","x","x","x",{"$f":"IFERROR(IF(SEARCH(AK$5,$D16),$F16,\"-\"),\"x\")","v":"x"},"x","x","x","x","x","x","x","x","x","x","x","x","x","x","x","x","x","x","x","x","x","x","x","x","x","x","x","x","x","x","x","x","x","x","x","x","x","x","x","x","x","x","x","x","x","x","x","x","x","x","x","x","x","x","x","--","x","x","x","x","x","x","x","x","x","x","x","x","x","x","x","x","x","x","x","x","x","x","x","x","x","x"]
[null,"C","There is no keyboard trap.","2.1.2-no-keyboard-trap","2.1.2","--",null,null,null,null,"x","x","x","x","x","x","x","x","x","x","x","--","x","x","x","x","x","x","x","x","x","x","x","x","x","x","x","x","x","x","x","x","x","x","x","x","x","x","x","x","x","x","x","x","x","x","x","x","x","x","x","x","x","x","x","x","x","x","x","x","x","x","x","x","x","x","x","x","x","x","x","x","x","x","x","x","x","x","x","x","x","x","x","--","x","x","x","x","x","x","x","x","x","x","x","x","x","x","x","x","x","x","x","x","x","x","x","x","x"]
[null,"D","A visible indication of focus is provided when focus is on the interface component.","2.4.7-focus-visible","2.4.7","--",null,null,null,null,"x","x","x","x","x","x","x","x","x","x","x","x","--","x","x","x","x","x","x","x","x","x","x","x","x","x","x","x","x","x","x","x","x","x","x","x","x","x","x","x","x","x","x","x","x","x","x","x","x","x","x","x","x","x","x","x","x","x","x","x","x","x","x","x","x","x","x","x","x","x","x","x","x","x","x","x","x","x","x","x","x","x","x","x","x","x","x","x","x","x","x","x","x","--","x","x","x","x","x","x","x","x","x","x","x","x","x","x","x"]
[null,"E","When an interface component receives focus, it does not initiate an unexpected change of context.","3.2.1-on-focus","3.2.1","--",null,null,null,null,"x","x","x","x","x","x","x","x","x","x","x","x","x","--","x","x","x","x","x","x","x","x","x","x","x","x","x","x","x","x","x","x","x","x","x","x","x","x","x","x","x","x","x","x","x","x","x","x","x","x","x","x","x","x","x","x","x","x","x","x","x","x","x","x","x","x","x","x","x","x","x","x","x","x","x","x","x","x","x","x","x","x","x","x","x","x","x","x","x","x","x","x","x","x","x","x","--","x","x","x","x","x","x","x","x","x","x","x","x"]
[null,"F","The focus order preserves the meaning and operability of the web page.","2.4.3-focus-order-meaning","2.4.3","--",null,null,null,null,"x","x","x","x","x","x","x","x","x","x","x","x","x","x","--","x","x","x","x","x","x","x","x","x","x","x","x","x","x","x","x","x","x","x","x","x","x","x","x","x","x","x","x","x","x","x","x","x","x","x","x","x","x","x","x","x","x","x","x","x","x","x","x","x","x","x","x","x","x","x","x","x","x","x","x","x","x","x","x","x","x","x","x","x","x","x","x","x","x","--","x","x","x","x","x","x","x","x","x","x","x","x","x","x","x","x","x","x","x"]
["5 Forms","A","Visual labels or instructions are provided for form elements. ","3.3.2-label-provided","3.3.2","--",null,5,null,null,{"$f":"IFERROR(IF(SEARCH(K$5,$D21),$F21,\"-\"),\"x\")","v":"x"},"x","x","x","x","x","x","x","x","x","x","x","x","x","x","x",{"$f":"IFERROR(IF(SEARCH(AA$5,$D21),$F21,\"-\"),\"x\")","v":"x"},"x","x","x","x","x","x","x","x","x","x","x","x","x","x","x","x","x","x","x","x","x","x","x","x","x","x","x","x","x","x","x","x","x","x","x","x","x","x","x","x","x","x","x","x","x","x","x","x","x","x","x","x","x","x","x","x",{"$f":"IFERROR(IF(SEARCH(CF$5,$E21),$F21,\"-\"),\"x\")","v":"x"},"x","x","x","x","x","x","x","x","x","x","x","x","x","x","x","x","x","x","x","x","x","x","x","x","x","x","x","--","x","x","x","x","x","x","x"]
[null,"B","Each visual form label is sufficiently descriptive. ","2.4.6-label-descriptive","2.4.6","--",null,5,null,null,"x","x","x","x","x","x","x","x","x","x","x","x","x","x","x","x","x","x","x","x","x","x","x","x","x","x","x","x","x","x","x","x","x","x","x","x","x","x","x","x","x","x","x","x","x","x","x","x","x","x","x","x","x","x","x","x","x","x","x","x","x","x","x","x","x","x","x",{"$f":"IFERROR(IF(SEARCH(BZ$5,$E22),$F22,\"-\"),\"x\")","v":"x"},"x","x","x","x","x","x","x","x","x","x","x","x","x","x","x","x","x","x","x","x","x","x","x","x","--","x","x","x","x","x","x","x","x","x","x","x","x","x","x","x","x"]
[null,"C","The combination of the accessible name, accessible description, and other programmatic associations (e.g., table column and/or row associations) describes each input field and includes all relevant instructions and cues (textual and graphical).","1.3.1-programmatic-label","1.3.1","--",null,5,null,null,"x","x","x","x","x","x","x","x","x","x","x","x","x","x","x","x","x","x","x","x","x","x","x","x","x","x","x","x","x","x","x","x","x","x","x","x","x","x","x","x","x","x","x","x","x","x","x","x","x","x","x","x",{"$f":"IFERROR(IF(SEARCH(BK$5,$D23),$F23,\"-\"),\"x\")","v":"x"},"x","x","x","x","x","x","x","x","x","x","x","x","x","x","x","x","x","x","x","x","x","--","x","x","x","x","x","x","x","x","x","x","x","x","x","x","x","x","x","x","x","x","x","x","x","x","x","x","x","x","x","x","x","x","x","x"]
[null,"D","Changing field values/selections (e.g., entering data in a text field, changing a radio button selection) does NOT initiate an unexpected change of context.","3.2.2-on-input","3.2.2","--",null,5,null,null,"x","x","x","x","x","x","x","x","x","x","x","x","x","x","x","x","x","x","x","--","x","x","x","x","x","x","x","x","x","x","x","x","x","x","x","x","x","x","x","x","x","x","x","x","x","x","x","x","x","x","x","x","x","x","x","x","x","x","x","x","x","x","x","x","x","x","x","x","x","x","x","x","x","x","x","x","x","x","x","x","x","x","x","x","x","x","x","x","x","x","x","x","x","x","x","x","x","--","x","x","x","x","x","x","x","x","x","x","x"]
[null,"F","[If error-checking is provided for a form field,] the item in error is identified in text and sufficiently described to the user in text.","3.3.1-error-identification","3.3.1","--",null,5,null,null,"x","x","x","x","x","x","x","x","x","x","x","x","x","x","x","x","x","x","x","x","x","--","x","x","x","x","x","x","x","x","x","x","x","x","x","x","x","x","x","x","x","x","x","x","x","x","x","x","x","x","x","x","x","x","x","x","x","x","x","x","x","x","x","x","x","x","x","x","x","x","x","x","x","x","x","x","x","x","x","x","x","x","x","x","x","x","x","x","x","x","x","x","x","x","x","x","x","x","x","x","--","x","x","x","x","x","x","x","x"]
[null,"G","[If error-checking is provided for a form field,] guidance is provided about how to correct errors for that field. ","3.3.3-error-suggestion","3.3.3","--",null,5,null,null,"x","x","x","x","x","x","x","x","x","x","x","x","x","x","x","x","x","x","x","x","x","x","--","x","x","x",{"$f":"IFERROR(IF(SEARCH(AK$5,$D26),$F26,\"-\"),\"x\")","v":"x"},"x","x","x","x","x","x","x","x","x","x","x","x","x","x","x","x","x",{"$f":"IFERROR(IF(SEARCH(BC$5,$D26),$F26,\"-\"),\"x\")","v":"x"},"x","x","x","x","x","x","x","x","x","x","x","x","x","x","x","x","x","x","x","x","x","x","x","x","x","x","x","x","x","x","x","x","x","x","x","x","x","x","x","x","x","x","x","x",{"$f":"IFERROR(IF(SEARCH(CV$5,$E26),$F26,\"-\"),\"x\")","v":"x"},"x","x","x","x","x","x","x","x","x","x","x","x","--","x","x","x",{"$f":"IFERROR(IF(SEARCH(DM$5,$E26),$F26,\"-\"),\"x\")","v":"x"},"x","x"]
[null,"H","[Multi-page forms that allow important transactions] allow the user to check, reverse, and/or confirm submission.","3.3.4-error-prevention","3.3.4","--",null,5,null,null,"x","x","x","x","x","x","x","x","x","x","x","x","x","x","x","x","x","x","x","x","x","x","x","--","x","x","x","x","x","x","x","x","x","x","x","x","x","x","x","x","x","x","x","x","x","x","x","x","x","x","x","x","x","x","x","x","x","x","x","x","x","x","x","x","x","x","x","x","x","x","x","x","x","x","x","x","x","x","x","x","x","x","x","x","x","x","x","x","x","x","x","x","x","x","x","x","x","x","x","x","x","x","x","--","x","x","x","x","x"]
["6 Links/buttons","A","The purpose of each link or button can be determined from any combination of the link/button text, accessible name, accessible description, and/or programmatically determined context.","2.4.4-link-purpose","2.4.4","--",null,null,null,null,"x","x","x","x","x","x","x","x","x","x","x","x","x","x","x","x","x","x","x","x","x","x","x","x","--","x","x","x","x","x","x","x","x","x","x","x","x","x","x","x","x","x","x","x","x","x","x","x","x","x","x","x","x","x","x","x","x","x","x","x","x","x","x","x","x","x","x","x","x","x","x","x","x","x","x","x","x","x","x","x","x","x","x","x","x","x","x","x","x","x","--","x","x","x","x","x","x","x",{"$f":"IFERROR(IF(SEARCH(DE$5,$E28),$F28,\"-\"),\"x\")","v":"x"},"x","x","x","x","x","x","x","x","x","x"]
["7 Images","A","The accessible name and accessible description for a meaningful image provides an equivalent description of the image.  ","1.1.1-meaningful-image-name","1.1.1","--",null,7,null,null,"x","x","x","x","x","x","x","x","x","x","x","x","x","x","x","x","x","x","x","x","x","x","x","x","x","x","--","x","x","x","x","x","x","x","x","x","x","x","x","x","x","x","x","x","x","x","x","x","x","x","x","x","x","x","x","x","x","x","x","x","x","x","x","x","x","x","x","x","--","x","x","x","x","x","x","x","x","x","x","x","x","x","x","x","x","x","x","x","x",{"$f":"IFERROR(IF(SEARCH(CV$5,$E29),$F29,\"-\"),\"x\")","v":"x"},"x","x","x","x","x","x","x","x","x","x","x","x","x","x","x","x","x","x","x"]
[null,"B","There is no accessible name and accessible description for a decorative image [or an image lacks accesssibility markup].","1.1.1-decorative-image","1.1.1","--",null,7,null,null,"x","x","x","x","x","x","x","x","x","x","x","x","x","x","x","x","x","x","x","x","x","x","x","x","x","x",{"$f":"IFERROR(IF(SEARCH(AK$5,$D30),$F30,\"-\"),\"x\")","v":"x"},"--","x","x","x","x","x","x","x","x","x","x","x","x","x","x","x","x","x","x","x","x","x","x","x","x","x","x","x","x","x","x","x","x","x","x","x","x","x","x","x","x","--","x","x","x","x","x","x","x","x","x","x","x","x","x","x","x","x","x","x","x","x","x","x","x","x","x","x","x","x","x","x","x","x","x","x","x","x","x","x","x","x"]
[null,"C","The background image is not the only means used to convey important information.","1.1.1- decorative-background-image","1.1.1","--",null,7,null,null,"x","x","x","x","x","x","x","x","x","x","x","x","x","x","x","x","x","x","x","x","x","x","x","x","x","x","x","x","--","x","x","x","x","x","x","x","x","x","x","x","x","x","x","x","x","x","x","x","x","x","x",{"$f":"IFERROR(IF(SEARCH(BJ$5,$D31),$F31,\"-\"),\"x\")","v":"x"},"x","x","x","x","x","x","x","x","x","x","x","x","x","x","x","x","--","x","x","x","x","x","x","x","x","x","x","x","x","x","x","x","x","x","x","x","x","x","x","x","x","x","x","x","x","x","x","x","x","x","x","x","x","x","x","x","x"]
[null,"D","Alternative forms of CAPTCHA are provided.","1.1.1-captcha-alternative","1.1.1","--",null,7,null,null,"x","x","x","x","x","x","x","x","x","x","x","x","x","x","x","x","x","x","x","x","x","x","x","x","x","x","x","x","x","x","--","x","x","x","x","x","x","x","x","x","x","x","x","x",{"$f":"IFERROR(IF(SEARCH(BC$5,$D32),$F32,\"-\"),\"x\")","v":"x"},"x","x","x","x","x","x","x","x","x","x","x","x","x","x","x","x","x","x","x","x","x","x","x","--","x","x","x","x","x","x","x","x","x","x","x","x","x","x","x","x","x","x","x","x","x","x","x","x","x","x","x","x","x","x","x","x","x","x","x","x","x","x","x","x"]
[null,"E","The image of text cannot be replaced by text or is customizable. ","1.4.5-image-of-text","1.4.5","--",null,7,null,null,"x","x","x","x","x","x","x","x","x","x","x","x","x","x","x","x","x","x","x","x","x","x","x","x","x","x","x","x","x","x","x","--","x","x","x","x","x","x","x","x","x","x","x","x","x","x","x","x","x","x","x","x","x","x","x","x","x","x","x","x","x","x","x","x","x","x","x","x","x","x","x","x","x","x","x","x","x","x","x","x","x","--","x","x","x","x","x","x","x","x","x","x","x","x","x","x","x","x","x","x","x","x","x","x","x","x","x","x","x"]
["8 Adjustable time limits","A","The user can turn off, adjust, or extend the time limit. ","2.2.1-timing-adjustable","2.2.1","--",null,null,null,null,"x","x","x","x","x","x","x","x","x","x","x","x","x","x","x","x","x","x","x","x","x","x","x","x","x","x","x","x","x","x","x","x","--","x","x","x","x","x","x","x","x","x","x","x","x","x","x","x","x","x","x","x","x","x","x","x","x","x","x","x","x","x","x","x","x","x","x","x","x","x","x","x","x","x","x","x","x","x","x","x","x","x","x","x","--","x","x","x","x","x","x","x","x","x","x","x","x","x","x","x","x","x","x","x","x","x","x","x","x"]
["9 Repetitive Content","A","A keyboard-accessible method is provided to bypass repetitive content. ","2.4.1-bypass-function","2.4.1","--","WO",null,null,null,"x","x","x","x","x","x","x","x","x","x","x","x","x","x","x","x","x","x","x","x","x","x","x","x","x","x","x","x","x","x","x","x","x","--","x","x","x","x","x","x","x","x","x","x","x","x","x","x","x","x","x","x","x","x","x","x","x","x","x","x","x","x","x","x","x","x","x","x","x","x","x","x","x","x","x","x","x","x","x","x","x","x",{"$f":"IFERROR(IF(SEARCH(CO$5,$E35),$F35,\"-\"),\"x\")","v":"x"},"x","x","x","x","--","x","x","x","x","x","x","x","x","x","x","x","x","x","x","x","x","x","x","x","x","x"]
[null,"B","Each navigational element occurs in the same relative order with regard to other repeated components on each web page where it appears.","3.2.3-consistent- navigation","3.2.3","--","WO",null,null,null,"x","x","x","x","x","x","x","x","x","x","x","x","x","x","x","x","x","x","x","x","x","x","x","x","x","x","x","x","x","x","x","x","x","x","--","x","x","x","x","x","x","x","x","x","x","x","x","x","x","x","x","x","x","x","x","x","x","x","x","x","x","x","x","x","x","x","x",{"$f":"IFERROR(IF(SEARCH(BZ$5,$E36),$F36,\"-\"),\"x\")","v":"x"},"x","x","x","x","x","x","x","x","x","x","x","x","x","x","x","x","x","x","x","x","x","x","x","x","x","x","x","x","x","x","--","x","x","x","x","x","x","x","x","x","x"]
[null,"C","The accessible name and description is consistent for components that perform the same function.","3.2.4-consistent-identification","3.2.4","--","WO",null,null,null,"x","x","x","x","x","x","x","x","x","x","x","x","x","x","x","x","x","x","x","x","x","x","x","x","x","x","x","x","x","x","x","x","x","x","x","--","x","x","x","x","x","x","x","x","x","x","x","x","x","x","x","x","x","x","x","x","x","x","x","x","x","x","x","x","x","x","x","x","x","x","x","x","x","x","x","x","x","x","x","x","x","x","x","x","x","x","x","x","x","x","x","x","x","x","x","x","x","x","x","--","x","x","x","x","x","x","x","x","x"]
["10 Content Structure","A","Each heading describes the topic or purpose of its content.","2.4.6-heading-purpose","2.4.6","--",null,null,null,null,"x","x","x","x","x","x","x","x","x","x","x","x","x","x","x","x","x","x","x","x","x","x","x","x","x","x","x","x","x","x","x","x","x","x","x","x","--","x","x","x",{"$f":"IFERROR(IF(SEARCH(AY$5,$D38),$F38,\"-\"),\"x\")","v":"x"},"x","x","x","x","x","x","x","x","x","x","x","x","x","x","x","x","x","x","x","x","x","x","x","x","x","x","x","x","x","x","x","x","x","x","x","x","x","x","x","x","x","x","x","x","x","x","x","x","x","x","x","--","x","x","x","x","x","x","x","x","x","x","x","x","x","x","x","x"]
[null,"B","Each programmatically determinable heading is a visual heading and each visual heading is programmatically determinable. ","1.3.1-heading-determinable","1.3.1","--",null,null,null,null,"x","x","x","x","x","x","x","x","x","x","x","x","x","x","x","x","x","x","x","x","x","x","x","x","x","x","x","x","x","x","x","x","x","x","x","x",{"$f":"IFERROR(IF(SEARCH(AU$5,$D39),$F39,\"-\"),\"x\")","v":"x"},"--","x","x","x","x","x","x","x","x","x","x","x","x","x","x","x","x","x","x","x","x","x","x","x","x","x","x","x","x","x","x","x","x","x","x","x","x","--","x","x","x","x","x","x","x","x","x","x","x","x","x","x","x","x","x","x","x","x","x","x","x","x","x","x","x","x","x","x","x","x","x","x"]
[null,"C","Programmatic heading levels logically match the visual heading presentation within the heading structure.","1.3.1-heading-level","1.3.1","--",null,null,null,null,"x","x","x","x","x","x","x","x","x","x","x","x","x","x","x","x","x","x","x","x","x","x","x","x","x","x","x","x","x","x","x","x","x","x","x","x","x","x","x","--","x","x","x","x","x","x","x","x","x","x","x","x","x","x","x","x","x","x","x","x","x","x","x","x","x","x","x","x","x","x","x","x","x","x","--","x","x","x","x","x","x","x","x","x","x","x","x","x","x","x","x","x","x","x","x","x","x","x","x","x","x","x","x","x","x","x","x","x","x"]
[null,"D","All visually apparent lists are programmatically identified according to their type.","1.3.1-list-type","1.3.1","--",null,null,null,null,"x","x","x","x","x","x","x","x","x","x","x","x","x","x","x","x","x","x","x","x","x","x","x","x","x","x","x","x","x","x","x","x","x","x","x","x","x","x","x","x","--","x","x","x","x","x","x","x","x","x","x","x","x","x","x","x","x","x","x","x","x","x","x","x","x","x","x","x","x","x","x","x","x","x","--","x","x","x","x","x","x","x","x","x","x","x","x","x","x","x","x","x","x","x","x","x","x","x","x","x","x","x","x","x","x","x","x","x","x"]
["11 Language","A","The default human language of each web page can be programmatically determined.","3.1.1-page-language-defined","3.1.1","--","WO",null,null,null,"x","x","x","x","x","x","x","x","x",{"$f":"IFERROR(IF(SEARCH(T$5,$D42),$F42,\"-\"),\"x\")","v":"x"},"x","x","x","x","x","x","x","x","x","x","x","x","x","x","x","x","x","x","x","x","x","x","x","x","x","x","x","x","x","x","x","--","x","x","x","x","x","x","x","x","x","x","x","x","x","x","x","x","x","x","x","x","x","x","x","x","x","x","x","x","x","x","x","x","x","x","x","x","x","x","x","x","x","x","x","x","x","x","x","x","x","x","x","x","--","x","x","x","x","x","x","x","x","x","x","x","x","x","x"]
[null,"B","The human language for any content segment that differs from the default human language of the page can be programmatically determined.","3.1.2-part-language-defined","3.1.2","--","WO",null,null,null,"x","x","x","x","x","x","x","x","x","x","x","x","x","x","x","x","x","x","x","x","x","x","x","x","x","x","x","x","x","x","x","x","x","x","x","x","x","x","x","x","x","x","--","x","x","x","x","x","x","x","x","x","x","x","x","x","x","x","x","x","x","x","x","x","x","x","x","x","x","x","x","x","x","x","x","x","x","x","x","x","x","x","x","x","x","x","x","x","x","x","x","x","x","x","x","--","x","x","x","x","x","x","x","x","x","x","x","x","x"]
["12 Page and Frame Titles","A","A <title> element is defined for the web page.","2.4.2-page-title-defined","2.4.2","--","WO",null,null,null,"x","x","x","x","x","x","x","x","x","x","x",{"$f":"IFERROR(IF(SEARCH(V$5,$D44),$F44,\"-\"),\"x\")","v":"x"},"x","x","x","x","x","x","x","x","x","x","x","x","x","x","x","x","x","x","x","x","x","x","x",{"$f":"IFERROR(IF(SEARCH(AT$5,$D44),$F44,\"-\"),\"x\")","v":"x"},"x","x","x","x","x","x","x","x","x","x","x","x","x","x","x","x","x","x","x","x","x","x","x","x","x","x","x","x","x","x","x","x","x","x","x","x","x","x","x","x","x","x","x","x","x","x","x","x","x","x","x","x","--","x","x","x","x","x","x","x","x","x","x","x","x","x","x","x","x","x","x","x","x"]
[null,"B","The <title> element identifies the contents or purpose of the web page.","2.4.2-page-title-purpose","2.4.2","--","WO",null,null,null,"x","x","x","x","x","x","x","x","x","x","x","x","x","x","x","x","x","x","x","x","x","x","x","x","x","x",{"$f":"IFERROR(IF(SEARCH(AK$5,$D45),$F45,\"-\"),\"x\")","v":"x"},"x","x","x","x","x","x","x","x","x","x","x","x","x","x","x","x","x","--","x","x","x","x","x","x","x","x","x","x","x","x","x","x","x","x","x","x","x","x","x","x","x","x","x","x","x","x","x","x","x","x","x","x","x","x","x","x","x","x","x","x","x","--","x","x","x","x","x","x","x","x","x","x","x","x","x","x","x","x","x","x","x","x"]
[null,"C","Each <frame> has a title attribute that describes its content. ","4.1.2-frame-title","4.1.2","--","WO",null,null,null,"x","x","x","x","x","x","x","x","x","x","x","x","x","x","x","x","x","x","x","x","x","x","x","x","x","x","x","x","x","x","x","x","x","x","x","x","x","x","x","x","x","x","x","x","x","--","x","x","x","x","x","x","x","x","x","x","x","x","x","x","x","x","x","x","x","x","x","x","x","x","x","x","x","x","x","x","x","x","x","x","x","x","x","x","x","x","x","x","x","x","x","x","x","x","x","x","x","x","x","x","x","x","x","x","x","--","x","x","x"]
[null,"D","The combination of accessible name and description for each focusable <iframe> describes its content.","4.1.2-iframe-name","4.1.2","--","WO",null,null,null,"x","x","x","x","x","x","x","x","x","x","x","x","x","x","x","x","x","x","x","x","x","x","x","x","x","x","x","x","x","x","x","x","x","x","x","x","x","x","x","x","x","x","x","x","x","x","--","x","x","x","x","x","x","x","x","x","x","x","x","x","x","x","x","x","x","x","x","x","x","x","x","x","x","x","x","x","x","x","x","x","x","x","x","x","x","x","x","x","x","x","x","x","x","x","x","x","x","x","x","x","x","x","x","x","x","--","x","x","x"]
["13 Sensory and Color","A","Color is not used as the only visual means of conveying information, indicating an action, prompting a response, or distinguishing a visual element. ","1.4.1-color-meaning","1.4.1","--",null,null,null,null,"x","x","x","x","x","x","x","x","x","x","x","x","x","x","x","x","x","x","x","x","x","x","x","x","x","x","x","x","x","x","x","x","x","x","x","x","x","x","x","x","x","x","x","x","x","x","x","--","x","x","x","x","x","x","x","x","x","x","x","x","x","x","x","x","x","x","x","x","x","x","x","x","x","x","x","x","x","--","x","x","x","x","x","x","x","x","x","x","x","x","x","x","x","x","x","x","x","x","x","x","x","x","x","x","x","x","x","x","x"]
[null,"B","Instructions provided for understanding and operating content do not rely solely on sensory characteristics of components, such as shape, color, size, visual location, orientation, or sound.","1.3.3-sensory-info","1.3.3","--",null,null,null,null,"x","x","x","x","x","x","x","x","x","x","x","x","x","x","x","x","x","x","x","x","x","x","x","x","x","x","x","x","x","x","x","x","x","x","x","x","x","x","x","x","x","x","x","x","x","x","x","x","--","x","x","x","x","x","x","x","x","x","x","x","x","x","x","x","x","x","x","x","x","x","x","x","x","x","x","x","--","x","x","x","x","x","x","x","x","x","x","x","x","x","x","x","x","x","x","x","x","x","x","x","x","x","x","x","x","x","x","x","x"]
[null,"C","The visual presentation of text and images of text have sufficient contrast. ","1.4.3-contrast","1.4.3","--",null,null,null,null,"x","x","x","x","x","x","x","x","x","x","x","x","x","x","x","x","x","x","x","x","x","x","x","x","x","x","x","x","x","x","x","x","x","x","x","x","x","x","x","x","x","x","x","x","x","x","x","x","x","--","x","x","x","x","x","x","x","x","x","x","x","x","x","x","x","x","x","x","x","x","x","x","x","x","x","x","x","x","x","--","x","x",{"$f":"IFERROR(IF(SEARCH(CO$5,$E50),$F50,\"-\"),\"x\")","v":"x"},"x","x","x","x","x","x","x","x","x","x","x","x","x","x","x","x","x","x","x","x","x","x","x","x","x","x"]
["14 Tables","A","Each data table has programmatic markup to identify it as a table. ","1.3.1-table-identification","1.3.1","--",null,14,null,null,"x","x","x","x","x","x","x","x","x","x","x","x","x","x","x","x","x","x","x","x","x","x","x","x","x","x","x","x","x","x","x","x","x","x","x","x","x","x","x","x","x","x","x","x","x","x","x","x","x","x","--","x","x","x","x","x","x","x","x","x","x","x","x","x","x","x","x",{"$f":"IFERROR(IF(SEARCH(BZ$5,$E51),$F51,\"-\"),\"x\")","v":"x"},"x","x","x","x","x","x","--","x","x","x","x","x","x","x","x","x","x","x","x","x","x","x","x","x","x","x","x","x","x","x","x","x","x","x","x","x","x","x","x","x","x"]
[null,"B","All data cells are programmatically associated with relevant headers. ","1.3.1-cell-header-association ","1.3.1","--",null,14,null,null,"x","x","x","x","x","x","x","x","x","x","x","x","x","x","x","x","x","x","x","x","x","x","x","x","x","x","x","x","x","x","x","x","x","x","x","x","x","x","x","x","x","x","x","x","x","x","x","x","x","x","x","--","x","x","x","x","x","x","x","x","x","x","x","x","x","x","x","x","x","x","x","x","x","x","--","x","x","x","x","x","x","x","x","x","x","x","x","x","x","x","x","x","x","x","x","x","x","x","x",{"$f":"IFERROR(IF(SEARCH(DF$5,$E52),$F52,\"-\"),\"x\")","v":"x"},"x","x","x","x","x","x","x","x","x"]
[null,"C","The layout table DOES NOT designate the layout table using ARIA role=\"table\" AND DOES NOT include table header structure and relationship elements and/or associated attributes.","1.3.1-layout-table-structure","1.3.1","--",null,14,null,null,"x","x","x","x","x","x","x","x","x","x","x","x","x","x","x","x","x","x","x","x","x","x","x","x","x","x","x","x","x","x","x","x","x","x","x","x","x","x","x","x","x","x","x","x","x","x","x","x","x","x","x","x","--","x","x","x","x","x","x","x","x","x","x","x","x","x","x","x","x","x","x","x","x","x","--","x","x","x","x","x","x","x","x","x","x","x","x","x","x","x","x","x","x","x","x","x","x","x",{"$f":"IFERROR(IF(SEARCH(DE$5,$E53),$F53,\"-\"),\"x\")","v":"x"},"x","x","x","x","x","x","x","x","x","x"]
["15 CSS","A","The reading order of the content (in context) is correct and the meaning of the content (in context) is preserved without CSS positioning.","1.3.2-content-order-meaning-CSS-position","1.3.2","--","WO",null,null,null,"x","x","x","x","x","x","x","x","x","x","x","x","x","x","x","x","x","x","x","x","x","x","x","x","x","x","x","x","x","x","x","x","x","x","x","x","x","x","x","x","x","x","x","x","x","x","x","x","x","x","x","x","x","x","x","x","x","x","x","x","x","x","x","x","x","x","x","x","x","x","x","x","x","x","x","--","x","x","x","x","x","x","x","x","x","x","x","x","x","x","x","x","x","x","x","x","x","x","x","x","x","x","x","x","x","x","x","x","x"]
["16 Audio/Video-Only","A","A text-based alternative is provided for audio-only content that provides an accurate and complete representation of the audio-only content.","1.2.1-audio-transcript-text","1.2.1","--",null,16,null,null,"x","x","x","x","x","x","x","x","x","x","x","x","x","x","x","x","x","x","x","x","x","x","x","x","x","x","x","x","x","x","x","x","x","x","x","x","x","x","x","x","x","x","x","x","x","x","x","x","x","x","x","x","x","x","x","x","--","x","x","x","x","x","x","x","x","x","x","x","x","--","x","x","x","x","x","x","x","x","x","x","x","x","x","x","x","x","x","x","x","x","x","x","x","x","x","x","x","x","x","x","x","x","x","x","x","x","x",{"$f":"IFERROR(IF(SEARCH(DN$5,$E55),$F55,\"-\"),\"x\")","v":"x"},"x"]
[null,"B","The video-only content information is also available through an equivalent text or audio alternative.","1.2.1-video- alternative-equivalent","1.2.1","--",null,16,null,null,"x","x","x","x","x","x","x","x","x","x","x","x","x","x","x","x","x","x","x","x","x","x","x","x","x","x","x","x","x","x","x","x","x","x","x","x","x","x","x","x","x","x","x","x","x","x","x","x","x","x","x","x","x","x","x","x","x","x","--","x","x","x","x","x","x","x","x","x","x","--","x","x","x","x","x","x","x","x","x","x","x","x","x","x","x","x","x","x","x","x","x","x","x","x","x","x","x","x","x","x","x","x","x","x","x","x","x","x","x"]
["17 Sync'd Media","A","The synchronized media provides accurate captions for the audio content.","1.2.2-captions-equivalent","1.2.2","--",null,17,null,null,"x","x","x","x","x","x","x","x","x","x","x","x","x","x","x","x","x","x","x","x","x","x","x","x","x","x","x","x","x","x","x","x","x","x","x","x",{"$f":"IFERROR(IF(SEARCH(AU$5,$D57),$F57,\"-\"),\"x\")","v":"x"},"x","x","x","x","x","x","x","x","x","x","x","x","x","x","x",{"$f":"IFERROR(IF(SEARCH(BK$5,$D57),$F57,\"-\"),\"x\")","v":"x"},"x","x","x","x","x","x","--","x","x","x","x","x","x","x","x","x","x","--","x","x","x","x","x","x","x","x","x","x","x","x","x","x","x","x","x","x","x","x","x","x","x","x","x","x","x","x","x","x","x","x","x","x","x","x","x","x"]
[null,"B","The synchronized media provides an equivalent soundtrack (combination of narration and audio descriptions) for the video content.","1.2.5-audio-description-equivalent","1.2.5","--",null,17,null,null,"x","x","x","x","x","x","x","x","x","x","x","x","x","x","x","x","x","x","x","x","x","x","x","x","x","x","x","x","x","x","x","x","x","x","x","x","x","x","x","x","x","x","x","x","x","x","x","x","x","x","x","x","x","x","x","x","x","x","x","x","--","x","x","x","x","x","x","x","x","x","x","x","x","--","x","x","x","x","x","x","x","x","x","x","x","x","x","x","x","x","x","x","x","x","x","x","x","x","x","x","x","x","x","x","x","x","x","x","x"]
[null,"C","The live synchronized media provides accurate captions for the audio content.","1.2.4-captions-live-equivalent","1.2.4","--",null,17,null,null,"x","x","x","x","x","x","x","x","x","x","x","x","x","x","x","x","x","x","x","x","x","x","x","x",{"$f":"IFERROR(IF(SEARCH(AI$5,$D59),$F59,\"-\"),\"x\")","v":"x"},"x","x","x","x","x","x","x","x","x","x","x","x","x","x","x","x","x","x","x","x","x","x","x","x","x","x","x","x","x","x","x","x","x","x","x","x","--","x","x","x","x","x","x","x","x","x","x","--","x","x","x","x","x","x","x","x","x","x","x","x","x","x","x","x","x","x","x","x","x","x","x","x","x","x","x","x","x","x","x","x","x","x","x","x"]
[null,"D","The media player provides user controls for closed captions.","503.4-caption-controls",503.4,"--",null,17,null,null,"x","x","x","x","x","x","x","x","x","x","x","x","x","x","x","x","x","x","x","x","x","x","x","x","x","x","x","x","x","x","x","x","x","x","x","x","x","x","x","x","x","x","x","x","x","x","x","x","x","x","x","x","x","x","x","x","x","x","x","x","x","x","x","x","x","x","x","x","x","x","x","x","x","x","x","x","x","x","x","x","x","x","x","x","x","x","x","x","x","x","x","x","x","x","x","x","x","x","x","x","x","x","x","x","x","x","x","x","x"]
[null,"E","The media player provides user controls for audio descriptions.","503.4-description-controls",503.4,"--",null,17,null,null,"x","x","x","x","x","x","x","x","x","x","x","x","x","x","x","x","x","x","x","x","x","x","x","x","x","x","x","x","x","x","x","x","x","x","x","x","x","x","x","x","x","x","x","x","x","x","x","x","x","x","x","x","x","x","x","x","x","x","x","x","x","x","x","x","x","x","x","x","x","x","x","x","x","x","x","x","x","x","x","x","x","x","x","x","x","x","x","x","x","x","x","x","x","x","x","x","x","x","x","x","x","x","x","x","x","x","x","x","x"]
[null,"F","User controls for captions are provided at the same menu level as the user controls for volume or program selection.","503.4.1-caption-control-level","503.4.1","--",null,17,null,null,"x","x","x","x","x","x","x","x","x","x","x","x","x","x","x","x","x","x","x","x","x","x","x","x","x","x","x","x","x","x","x","x","x","x","x","x","x","x","x","x","x","x","x","x","x","x","x","x","x","x","x","x","x","x","x","x","x","x","x","x","x","x","x","--","x","x","x","x","x","x","x","x","x","x","x","x","x","x","x","x","x","x","x","x","x","x","x","x","x","x","x","x","x","x","x","x","x","x","x","x","x","x","x","x","x","x","x","--","x"]
[null,"G","User controls for audio descriptions are provided at the same menu level as the user controls for volume or program selection.","503.4.2-description-control-level","503.4.2"]
["18 Resize Text","A","There is a mechanism to resize, scale, or zoom in on the text to at least 200% of its original size without loss of content or functionality.","1.4.4-resize-text","1.4.4","--",null,null,null,null,{"$f":"IFERROR(IF(SEARCH(K$5,$D64),$F64,\"-\"),\"x\")","v":"x"},"x","x","x","x","x","x","x","x","x","x","x","x",{"$f":"IFERROR(IF(SEARCH(X$5,$D64),$F64,\"-\"),\"x\")","v":"x"},"x",{"$f":"IFERROR(IF(SEARCH(Z$5,$D64),$F64,\"-\"),\"x\")","v":"x"},"x","x","x","x","x","x","x","x","x",{"$f":"IFERROR(IF(SEARCH(AJ$5,$D64),$F64,\"-\"),\"x\")","v":"x"},"x","x","x","x","x","x","x","x","x",{"$f":"IFERROR(IF(SEARCH(AT$5,$D64),$F64,\"-\"),\"x\")","v":"x"},"x","x","x","x","x","x","x","x","x","x","x","x","x","x","x","x","x","x","x","x","x","x","x","x","x","x","x","x","x","--","x",{"$f":"IFERROR(IF(SEARCH(BZ$5,$E64),$F64,\"-\"),\"x\")","v":"x"},{"$f":"IFERROR(IF(SEARCH(CA$5,$E64),$F64,\"-\"),\"x\")","v":"x"},"x","x","x","x","x","x","x","x","x","x","x","--","x","x","x","x","x","x","x","x","x","x","x","x","x","x","x","x","x","x","x","x","x","x","x","x","x",{"$f":"IFERROR(IF(SEARCH(DM$5,$E64),$F64,\"-\"),\"x\")","v":"x"},{"$f":"IFERROR(IF(SEARCH(DN$5,$E64),$F64,\"-\"),\"x\")","v":"x"},"x"]
["19 Multiple Ways","A","There are two or more ways to locate a web page within a set of web pages.","2.4.5-multiple-ways","2.4.5","--","WO",null,null,null,"x","x","x","x","x","x","x","x","x","x","x","x","x","x","x","x","x","x","x","x","x","x","x","x","x","x","x","x","x","x","x","x","x","x","x",{"$f":"IFERROR(IF(SEARCH(AT$5,$D65),$F65,\"-\"),\"x\")","v":"x"},"x","x","x","x","x","x","x","x","x","x","x","x","x","x","x","x","x","x","x","x","x","x","x","x","x","x","x","x","x","x","--","x","x","x","x","x","x","x","x","x","x","x","x","x","x","x","x","x","x","x","x","x","x","x","x","--","x","x","x","x","x","x","x","x","x","x","x","x","x","x","x",{"$f":"IFERROR(IF(SEARCH(DN$5,$E65),$F65,\"-\"),\"x\")","v":"x"},"x"]
["20 Parsing","A","Parsing requirement is not tested.","Always \"Not tested\"",null,"Not tested","--","WO",null,null,{"$f":"IFERROR(IF(SEARCH(L$5,$E66),$G66,\"-\"),\"x\")","v":"x"},"x","x","x","x","x","x","x","x","x","x","x","x","x","x","x","x","x","x","x","x","x","x","x","x","x","x","x","x","x","x","x",{"$f":"IFERROR(IF(SEARCH(AR$5,$E66),$G66,\"-\"),\"x\")","v":"x"},"x","x","x","x","x","x","x","x","x","x","x","x","x","x","x","x","x","x","x","x","x","x","x","x","x","x","x","x","x","x","x","x","x","x",{"$f":"IFERROR(IF(SEARCH(CA$5,$F66),$G66,\"-\"),\"x\")","v":"x"},"x","x","x","x","x","x","x","x","x","x","x","x","x","x","x","x","x","x","x","x","x","x","x","x","x","x","x","x","x","x","x","x","x","x","x","x","x","x","x","x","--"]
[null,null,null,null,null,"Fail","Last"]
[null,null,null,null,null,"Pass"]
[null,null,null,null,null,"DNA"]
[null,null,null,null,null,"Not Tested"]

{"sheet":"Report","index":3,"n_rows":26,"n_cols":12,"rows_kept":26,"cut":false,"hidden":false,"merged":[[22,3,22,4],[0,7,0,23],[7,11,7,21],[3,10,3,21],[1,10,1,21],[6,11,6,21],[5,11,5,21]]}
[null,null,null,null,null,null,null,"Agency Specific Test Approaches for DHS"]
[]
[null,null,null,"Trusted Tester Name:"]
[null,null,null,"Trusted Tester ID #:",null,null,null,null,null,null,"DHS specific test approach for Flashing (SC 2.3.1)"]
[null,null,null,"Test Process Used:","TT5.1.3"]
[null,null,null,"Review Date:",null,null,null,null,null,null,null,"As we do not have a reliable tool to test for flashing at this time:"]
[null,null,null,"Application Name:",null,null,null,null,null,null,null,"If NO flashing content is found, then this Test Condition DOES NOT APPLY (DNA). If flashing content IS found, then this test should be recorded as NOT TESTED."]
[null,null,null,"Application Version Tested:"]
[null,null,null,"URL (if web site):"]
[null,null,null,"Vendor:"]
[null,null,null,"Application Description:"]
[null,null,null,"Functions Tested:"]
[null,null,null,"Test Results:","--"]
[null,null,null,"Disabilities Impacted:"]
[null,null,null,"Test Environment"]
[null,null,null,"Operating System:"]
[null,null,null,"Browser:"]
[null,null,null,"Browser Version:"]
[null,null,null,"Compatibility View","--"]
[]
[null,null,null,"Additional Comments:"]
[]
[null,null,null,"Note: This review is a sampling of pages to confirm the component self-assessment as to their compliance with Section 508. The responsibility for full and complete testing and compliance remains with the owner of the application or website.\n\nTo view the report electronically:\n1. Open the Report tab.\n2. Page 1 contains application information.  To the right of Page 1 is standard test information that is part of our reports.\n3. The compliance issues begin on Page 2.  Each issue is marked with a Defect #, a description of the issue, and may include a screenshot of the issue found.  To view the screenshot, select the cell with the screenshot address and press ctrl-w.  This will open the screenshot in a new window.\n\nTo print the report:\n1. Open the Report tab.\n2. Select File > Print > Print button.  \n4. Screenshots can only be viewed electronically and will not be printed in the report.\n"]
[]
["Defect #","Test name","SC","Test Condition Failed","Details","Screenshot (Ctrl-w)"]
[1,"Alt-version-equivalent","CR1","1 Alternate version","The accessible version is up to date with the same information and functionality.. \r\nExample: ","J7"]

{"sheet":"508 Impact Guide & Score Sheet","index":4,"n_rows":57,"n_cols":7,"rows_kept":57,"cut":false,"hidden":true,"merged":[[56,2,56,6],[53,0,53,6],[0,1,0,6],[1,0,1,6],[2,0,2,6],[16,0,16,6],[51,0,51,6],[52,2,52,6]]}
["Application Name:",{"$f":"Report!E7","v":0}]
["Section 508 Software, Web, Multimedia and Functional Performance Criteria Failures Impact Report"]
["The results of testing for 508 Software and Web standards are shown below: C=compliant, NC=not compliant, NA=not applicable.  This table shows the impact of each 508 standard on specific disability groups.  (*Other includes color blindness, cognitive and seizure-related disabilities.)  The testing outcome is shown at the bottom of this page."]
["1194.21 Software Standards","Test Results","Blind","Low Vision","Deaf/ Hard of Hearing","Mobility","*Other"]
["a. Keyboard access",{"$f":"Results!K4","v":"--"},"x",null,null,"x"]
["b. OS accessibility settings ",{"$f":"Results!L4","v":"--"},null,"x","x","x"]
["c. On screen focus",{"$f":"Results!M4","v":"--"},"x","x",null,"x"]
["d. Sufficient information for user interface elements",{"$f":"Results!N4","v":"--"},"x",null,null,"x"]
["e. Bit map image consistency",{"$f":"Results!O4","v":"--"},null,null,null,null,"x"]
["f. Textual information through operating system functions",{"$f":"Results!P4","v":"--"},"x"]
["g. User color and contrast settings",{"$f":"Results!Q4","v":"--"},null,"x"]
["h. Animation alternative",{"$f":"Results!R4","v":"--"},"x","x"]
["i. Color dependency",{"$f":"Results!S4","v":"--"},"x","x",null,null,"x"]
["j. Color selection variety",{"$f":"Results!T4","v":"--"},null,"x",null,null,"x"]
["k. Flashing elements",{"$f":"Results!U4","v":"--"},null,null,null,null,"x"]
["l. Label form fields",{"$f":"Results!V4","v":"--"},"x"]
[]
["Disabilities Impacted by all 508 Software Failures",null,{"$f":"IF(OR(B5=\"nc\",,B7=\"nc\",B8=\"nc\",B10=\"nc\",B12=\"nc\",B13=\"nc\",B16=\"nc\"),\"X\",\"\")","v":""},{"$f":"IF(OR(B6=\"nc\",B7=\"nc\",B11=\"nc\",B12=\"nc\",B13=\"nc\",B14=\"nc\"),\"X\",\"\")","v":""},{"$f":"IF(B6=\"nc\",\"X\",\"\")","v":""},{"$f":"IF(OR(B5=\"nc\",B6=\"nc\",B7=\"nc\",B8=\"nc\"),\"X\",\"\")","v":""},{"$f":"IF(OR(B9=\"nc\",B15=\"nc\",B14=\"nc\",B13=\"nc\"),\"X\",\"\")","v":""}]
[]
["1194.22 Web Standards","Test Results","Blind","Low Vision","Deaf/ Hard of Hearing","Mobility","*Other"]
["a. Text equivalents ",{"$f":"Results!W4","v":"--"},"x"]
["b1. Synchronized captions",{"$f":"Results!X4","v":"--"},null,null,"x"]
["b2. Synchronized audio description",{"$f":"Results!Y4","v":"--"},"x","x"]
["c. Color dependence",{"$f":"Results!Z4","v":"--"},"x","x",null,null,"x"]
["d. Style sheet dependence",{"$f":"Results!AA4","v":"--"},"x","x",null,null,"x"]
["e and f. Use of server side image maps",{"$f":"Results!AC4","v":"--"},"x",null,null,"x"]
["g. Data tables: Identify row and column headers",{"$f":"Results!AD4","v":"--"},"x"]
["h. Complex data tables: Associate data cells to row and column headers",{"$f":"Results!AE4","v":"--"},"x"]
["i. Descriptive titles for frames.",{"$f":"Results!AF4","v":"--"},"x"]
["j. Flashing elements",{"$f":"Results!AG4","v":"--"},null,null,null,null,"x"]
["k. Equivalent text only page, only when necessary.",{"$f":"Results!AH4","v":"--"},"x","x","x","x"]
["l. Functional text for scripts",{"$f":"Results!AI4","v":"--"},"x"]
["m. Provide plugin links when required",{"$f":"Results!AJ4","v":"--"},"x"]
["n. Label form fields",{"$f":"Results!AK4","v":"--"},"x"]
["o. Skip repetitive navigation links",{"$f":"Results!AL4","v":"--"},"x","x",null,"x"]
["p. Timed response",{"$f":"Results!AM4","v":"--"},"x","x",null,"x","x"]
[]
["Disabilities Impacted by all 508 Web Failures",null,{"$f":"IF(OR(B21=\"nc\",B23=\"nc\",B24=\"nc\",B25=\"nc\",B26=\"nc\",B27=\"nc\",B28=\"nc\",B29=\"nc\",B31=\"nc\",B32=\"nc\",B32=\"nc\",B33=\"nc\",B34=\"nc\",B35=\"nc\",B36=\"nc\"),\"X\",\"\")","v":""},{"$f":"IF(OR(B23=\"nc\",B24=\"nc\",B25=\"nc\",B31=\"nc\",B35=\"nc\",B36=\"nc\"),\"X\",\"\")","v":""},{"$f":"IF(OR(B22=\"nc\",B31=\"nc\"),\"X\",\"\")","v":""},{"$f":"IF(OR(B26=\"nc\",B31=\"nc\",B35=\"nc\",B36=\"nc\"),\"X\",\"\")","v":""},{"$f":"IF(OR(B25=\"nc\",B30=\"nc\",B36=\"nc\",B24=\"nc\"),\"X\",\"\")","v":""}]
[]
["1194.24 Multimedia Standards","Test Results","Blind","Low Vision","Deaf/ Hard of Hearing","Mobility","*Other"]
["c. Captions",{"$f":"Results!X4","v":"--"},null,null,"x"]
["d. Audio Descriptions",{"$f":"Results!Y4","v":"--"},"x","x"]
[]
["1194.31 Functional Performance Criteria Standards","Test Results","Blind","Low Vision","Deaf/ Hard of Hearing","Mobility","*Other"]
["a. Use without vision",{"$f":"Results!AP4","v":"--"},"x"]
["b. Use with low vision",{"$f":"Results!AQ4","v":"--"},null,"x"]
["c. Use  without hearing",{"$f":"Results!AR4","v":"--"},null,null,"x"]
["f. Use with physical limitations",{"$f":"Results!AS4","v":"--"},null,null,null,"x"]
[]
["Disabilities Impacted by Software, Web  and FPC Provision Failures",{"$f":"IF(AND(B18=\"none\",B38=\"none\"),\"NONE\",\"\")","v":""},{"$f":"IF(OR(B42=\"nc\",C18=\"X\",C38=\"X\",B45=\"nc\"),\"X\",\"\")","v":""},{"$f":"IF(OR(D18=\"X\",D38=\"X\",B42=\"nc\",B46=\"nc\"),\"X\",\"\")","v":""},{"$f":"IF(OR(E18=\"X\",E38=\"X\",B41=\"nc\",B47=\"nc\"),\"X\",\"\")","v":""},{"$f":"IF(OR(F18=\"X\",F38=\"X\",B48=\"nc\"),\"X\",\"\")","v":""},{"$f":"IF(OR(G18=\"X\",G38=\"X\"),\"X\",\"\")","v":""}]
[]
["Testing Outcome"]
["Total Disabilities Impacted by 508 failures:",{"$f":"COUNTIF(C50:G50,\"X\")","v":0},{"$f":"IF(B53>0,LEFT(C57,LEN(C57)-2),\"None\")","v":"None"}]
["(If 1 or more disabilities are unable to use this application due to 508 failures, this application is Not Compliant.)"]
[]
[null,null,{"$f":"IF(C50=\"X\",\"Blind, \",\"\")","v":""},{"$f":"IF(D50=\"X\",\"Low Vision, \",\"\")","v":""},{"$f":"IF(E50=\"X\",\"Deaf/Hard of Hearing, \",\"\")","v":""},{"$f":"IF(F50=\"X\",\"Mobility, \",\"\")","v":""},{"$f":"IF(G50=\"X\",\"Other, \",\"\")","v":""}]
[null,null,{"$f":"IF(B53>0,CONCATENATE(C56,D56,E56,F56,G56),\"None\")","v":"None"}]